Run,Program Version,Time Started (UTC),Minutes Spent,Position,Points,age,device,gender,employed,education,projectID,startedAt,computerID,creditScore,assignmentID,ethnicityUsa,religiousness,yearOfBirth,participantID,educationScore,ethnicityBlack,politicalViews,computerCountry,filedBankruptcy,householdIncome,socialMediaUse,employmentStatus,femaleAs1MaleAs0,outcomeCreditScore,politicalLiberalness,filedBankruptcyScore,householdIncomeScore,overallPhysicalHealth,outcomeSocialMediaUse,householdIncomeEstimate,outcomeRelationshipNone,outcomeKnowsCreditScore,outcomeReligiousness0To5,mostRecentMentalHealthDiagnosis,outcomeOverallPhysicalHealth,everDiagnosedMentalHealthDisorder,ethnicityWhite,outcomeRelationshipJustStarted,How satisfied are you with life as a whole these days? (ql4c1ak),ethnicityLatino,How enjoyable is your life as a whole these days? (dzyh760),outcomeRelationshipLongTerm,"Imagine I gave you a ""SKIP TOMORROW"" button. When pressed, this button would cause you to be instantly transported 24 hours into the future. You still do all the things you would normally do (so nobody else can tell any difference), and remember the day normally, you just don't experience it. Afterwards, you forget you pressed the button. *Would you press this button to skip tomorrow?* (5jpyee3)",buttontext,finished,project_id,assignment_id,participant_id,url,ethnicityOther,ethnicityNative,ethnicityIslander,ethnicityAsian
7568230,3,2022-08-01 23:04:42,0.62,rl4pf73,0,56,desktop,male,1,completedAssociateDegreeOnly,pa36a3a6c,2022/08/01 04:04 PM,853b1f844e19155dde10f08c62d390c205d1d4e7,Good: 670 - 739,pf3161df4,"White, Caucasian or European",Slightly religious,1966,p21e59c3e,4,,Liberal,United States,no,"$25,000 to $39,999",more than 3 hours,Full-time work,0,670,1,0,2,Above average,180,32500,,1,1,depression,2,1,1,1,7,,6,,No,Click to finish and give feedback,1,pa36a3a6c,pf3161df4,p21e59c3e,https://app.positly.com/#/f?task_id=pa36a3a6c,,,,
7568231,3,2022-08-01 23:04:42,0.45,rl4pf73,0,26,desktop,female,1,completedBachelorsDegree,pa36a3a6c,2022/08/01 04:04 PM,955f0e905f4d0205d32abdffd17c81763c5fcb00,I do not remember my FICO credit score,pda4ceea5,"Black, African or African Descent",Not at all religious,1996,p6a95a257,5,1,Liberal,United States,no,"$40,000 to $59,999",up to 3 hours,Full-time work,1,300,1,0,3,Average,90,50000,1,0,0,other,0,1,,,10,,10,,No,Click to finish and give feedback,1,pa36a3a6c,pda4ceea5,p6a95a257,https://app.positly.com/#/f?task_id=pa36a3a6c,,,,
7568232,3,2022-08-01 23:04:47,0.3,rl4pf73,0,31,desktop,male,1,completedOnlyHighSchoolOrTheEquivalent,pa36a3a6c,2022/08/01 04:04 PM,2104f3692a8e5a76868743deb02e232835d03de7,Fair: 580 - 669,pd5ec97aa,"Latino, Hispanic or Spanish origin",Not at all religious,1991,p18c27c8b,2,,Moderate,United States,no,"$25,000 to $39,999",up to 3 hours,Full-time work,0,580,0,0,2,Far above average,90,32500,1,1,0,none,3,0,,,10,1,10,,No,Click to finish and give feedback,1,pa36a3a6c,pd5ec97aa,p18c27c8b,https://app.positly.com/#/f?task_id=pa36a3a6c,,,,
7568238,3,2022-08-01 23:05:03,0.35,rl4pf73,0,27,desktop,female,1,completedBachelorsDegree,pa36a3a6c,2022/08/01 04:04 PM,6c8bd5805eb3474ea4cee3d4143ce494e5a92d37,Very Good: 740 - 799,pb56ec005,"White, Caucasian or European",Extremely religious,1995,pa6899725,5,,Conservative,United States,no,"$60,000 to $84,999",up to 3 hours,Full-time work,1,740,-1,0,4,Average,90,72500,,1,5,none,0,0,1,,8,,6,1,Yes,Click to finish and give feedback,1,pa36a3a6c,pb56ec005,pa6899725,https://app.positly.com/#/f?task_id=pa36a3a6c,,,,
7568239,3,2022-08-01 23:05:09,0.32,rl4pf73,0,31,desktop,female,1,completedAssociateDegreeOnly,pa36a3a6c,2022/08/01 04:04 PM,40ea178c1357a41ca9232631db1b0d8b1d993471,Fair: 580 - 669,pbaacadb6,"White, Caucasian or European",Not at all religious,1991,pcf76af8d,4,,Very liberal,United States,no,"$10,000 to $24,999",about an hour,Part-time work,1,580,2,0,1,A little below average,45,17500,1,1,0,anxiety,-1,1,1,,3,,6,,No,Click to finish and give feedback,1,pa36a3a6c,pbaacadb6,pcf76af8d,https://app.positly.com/#/f?task_id=pa36a3a6c,,,,
7568240,3,2022-08-01 23:05:13,0.22,rl4pf73,0,36,desktop,female,1,completedMastersDegree,pa36a3a6c,2022/08/01 04:04 PM,cddf057f31ad811a701587251f0e23f21b0cf351,Very Poor: 300 - 579,pbd792815,"White, Caucasian or European",Slightly religious,1986,p1d7fa892,6,,Moderate,United States,no,"$25,000 to $39,999",more than 3 hours,Full-time work,1,300,0,0,2,Above average,180,32500,,1,1,anxiety,2,1,1,,6,,6,1,No,Click to finish and give feedback,1,pa36a3a6c,pbd792815,p1d7fa892,https://app.positly.com/#/f?task_id=pa36a3a6c,,,,
7568241,3,2022-08-01 23:05:14,0.62,rl4pf73,0,38,desktop,male,1,completedTradeTechicalVocationalTraing,pa36a3a6c,2022/08/01 04:04 PM,036ec2fc7e92d40069c3ada6c7e71e3ec1389a34,Very Poor: 300 - 579,pcf1b6795,"Black, African or African Descent",Not at all religious,1984,pa6c9f3ca,3,1,Moderate,United States,no,"$60,000 to $84,999",more than 3 hours,Own business / Self-employed,0,300,0,0,4,Above average,180,72500,1,1,0,anxiety,2,1,,,6,,6,,Yes,Click to finish and give feedback,1,pa36a3a6c,pcf1b6795,pa6c9f3ca,https://app.positly.com/#/f?task_id=pa36a3a6c,,,,
7568242,3,2022-08-01 23:05:14,0.18,rl4pf73,0,33,desktop,female,1,nurseryTo8thGrade,pa36a3a6c,2022/08/01 04:05 PM,c0a837a84e0605cd06780287b8acc20823181a26,I do not remember my FICO credit score,pbb7f7a86,"Latino, Hispanic or Spanish origin",Moderately religious,1989,p1a85054c,1,,Conservative,United States,no,"$60,000 to $84,999",less than 30 minutes,Own business / Self-employed,1,300,-1,0,4,Above average,15,72500,1,0,3,other,2,1,,,8,1,9,,No,Click to finish and give feedback,1,pa36a3a6c,pbb7f7a86,p1a85054c,https://app.positly.com/#/f?task_id=pa36a3a6c,,,,
7568244,3,2022-08-01 23:05:23,0.38,rl4pf73,0,58,desktop,female,0,completedMastersDegree,pa36a3a6c,2022/08/01 04:05 PM,43fee1201c2a299acc1760c2d437970d12506181,Exceptional: 800 - 850,pa9a6e2c5,"White, Caucasian or European",Slightly religious,1964,pfcc4d884,6,,Liberal,United States,no,"$115,000 to $149,999",less than 30 minutes,Homemaker,1,800,1,0,6,A little above average,15,132500,,1,1,depression,1,1,1,,3,,3,1,No,Click to finish and give feedback,1,pa36a3a6c,pa9a6e2c5,pfcc4d884,https://app.positly.com/#/f?task_id=pa36a3a6c,,,,
7568245,3,2022-08-01 23:05:34,0.27,rl4pf73,0,35,desktop,male,0,completedBachelorsDegree,pa36a3a6c,2022/08/01 04:05 PM,c30d3b70f69de7e36d215d455d4d55ca4943e0f9,Good: 670 - 739,pf4c23d4f,"White, Caucasian or European",Not at all religious,1987,pc3abf7b5,5,,Very liberal,United States,no,"$10,000 to $24,999",up to 3 hours,Unemployed,0,670,2,0,1,Below average,90,17500,1,1,0,anxiety,-2,1,1,,0,,0,,No,Click to finish and give feedback,1,pa36a3a6c,pf4c23d4f,pc3abf7b5,https://app.positly.com/#/f?task_id=pa36a3a6c,,,,
7568246,3,2022-08-01 23:05:37,0.25,rl4pf73,0,24,desktop,male,1,completedOnlyHighSchoolOrTheEquivalent,pa36a3a6c,2022/08/01 04:05 PM,0b4d4fcb7be0e4433538627d1aa02577196b4a2b,I do not have a FICO credit score,pb65f0ddc,"Some other race, ethnicity or origin",Moderately religious,1998,p52b08de0,2,,Moderate,United States,no,"$10,000 to $24,999",more than 3 hours,Other type of paid work,0,-1,0,0,1,Above average,180,17500,1,1,3,none,2,0,,,2,,2,,No,Click to finish and give feedback,1,pa36a3a6c,pb65f0ddc,p52b08de0,https://app.positly.com/#/f?task_id=pa36a3a6c,1,,,
7568247,3,2022-08-01 23:05:42,0.47,rl4pf73,0,39,desktop,male,1,completedBachelorsDegree,pa36a3a6c,2022/08/01 04:05 PM,8a8f1c5345d31be44eabc21be76c9525a7592de4,Good: 670 - 739,paf55c125,"Latino, Hispanic or Spanish origin",Not at all religious,1983,p0db15c77,5,,Liberal,United States,no,"$40,000 to $59,999",about an hour,Full-time work,0,670,1,0,3,A little above average,45,50000,1,1,0,none,1,0,,,2,1,3,,Yes,Click to finish and give feedback,1,pa36a3a6c,paf55c125,p0db15c77,https://app.positly.com/#/f?task_id=pa36a3a6c,,,,
7568249,3,2022-08-01 23:05:51,0.8,rl4pf73,0,60,desktop,female,1,completedOnlyHighSchoolOrTheEquivalent,pa36a3a6c,2022/08/01 04:05 PM,47a88b4e84e2cc469dd769569b35e1dfdcb75770,Good: 670 - 739,pafba12b4,"White, Caucasian or European",Somewhat religious,1962,pb3e97cad,2,,Moderate,United States,yes,"$60,000 to $84,999",less than 30 minutes,Own business / Self-employed,1,670,0,1,4,Average,15,72500,,1,2,none,0,0,1,,7,,7,1,No,Click to finish and give feedback,1,pa36a3a6c,pafba12b4,pb3e97cad,https://app.positly.com/#/f?task_id=pa36a3a6c,,,,
7568250,3,2022-08-01 23:05:54,0.42,rl4pf73,0,28,desktop,male,1,completedBachelorsDegree,pa36a3a6c,2022/08/01 04:04 PM,43d34cf8e044d865eec1d07ce243502743ffa0bd,Very Good: 740 - 799,pab598e56,"White, Caucasian or European",Not at all religious,1994,p6d7849c0,5,,Very liberal,United States,no,"$200,000 or more",about an hour,Own business / Self-employed,0,740,2,0,8,A little above average,45,225000,1,1,0,other,1,1,1,,0,,0,,No,Click to finish and give feedback,1,pa36a3a6c,pab598e56,p6d7849c0,https://app.positly.com/#/f?task_id=pa36a3a6c,,,,
7568251,3,2022-08-01 23:06:19,0.5,rl4pf73,0,41,desktop,male,1,completedBachelorsDegree,pa36a3a6c,2022/08/01 04:05 PM,b5450437621668bf247e98fe31a1e39206959a4a,Very Poor: 300 - 579,pf38a7a4c,"White, Caucasian or European",Not at all religious,1981,pfa21a665,5,,Liberal,United States,no,"$10,000 to $24,999",less than 30 minutes,Own business / Self-employed,0,300,1,0,1,A little above average,15,17500,1,1,0,anxiety,1,1,1,,2,,2,,Yes,Click to finish and give feedback,1,pa36a3a6c,pf38a7a4c,pfa21a665,https://app.positly.com/#/f?task_id=pa36a3a6c,,,,
7568252,3,2022-08-01 23:06:32,0.5,rl4pf73,0,29,desktop,male,1,completedAssociateDegreeOnly,pa36a3a6c,2022/08/01 04:04 PM,2fd2e6dd4519323fb3927e9985a068ed5c12486b,I do not remember my FICO credit score,pc6afea06,"Black, African or African Descent",Not at all religious,1993,pd4dd845d,4,1,Liberal,United States,no,"$40,000 to $59,999",less than 30 minutes,Own business / Self-employed,0,300,1,0,3,Above average,15,50000,1,0,0,none,2,0,,,10,,10,,No,Click to finish and give feedback,1,pa36a3a6c,pc6afea06,pd4dd845d,https://app.positly.com/#/f?task_id=pa36a3a6c,,,,
7568253,3,2022-08-01 23:06:34,0.33,rl4pf73,0,41,desktop,female,1,completedOnlyHighSchoolOrTheEquivalent,pa36a3a6c,2022/08/01 04:06 PM,faec161e79c965585be00f62b0f68684e6e8341b,Very Poor: 300 - 579,pbad7ade6,American Indian or Alaska Native,Not at all religious,1981,pd37bee9b,2,,Conservative,United States,no,"$25,000 to $39,999",up to 3 hours,Full-time work,1,300,-1,0,2,Average,90,32500,,1,0,personalityDisorder,0,1,,,8,,7,1,No,Click to finish and give feedback,1,pa36a3a6c,pbad7ade6,pd37bee9b,https://app.positly.com/#/f?task_id=pa36a3a6c,,1,,
7568254,3,2022-08-01 23:06:35,0.28,rl4pf73,0,42,desktop,male,1,completedOnlyHighSchoolOrTheEquivalent,pa36a3a6c,2022/08/01 04:06 PM,3b95694af3a0e7fdb9169ccf11fcebc1af50c2ec,Fair: 580 - 669,pf8cdb920,"White, Caucasian or European",Not at all religious,1980,p295a2906,2,,Liberal,United States,no,"Less than $9,999",less than 30 minutes,Own business / Self-employed,0,580,1,0,0,Below average,15,4500,1,1,0,none,-2,0,1,,1,,2,,Yes,Click to finish and give feedback,1,pa36a3a6c,pf8cdb920,p295a2906,https://app.positly.com/#/f?task_id=pa36a3a6c,,,,
7568256,3,2022-08-01 23:06:32,0.7,rl4pf73,0,30,desktop,male,1,completedAssociateDegreeOnly,pa36a3a6c,2022/08/01 04:06 PM,89327e980bb8b38845082e4712a1b4aac7a0e3dc,Very Good: 740 - 799,pb7c64609,"White, Caucasian or European",Not at all religious,1992,p1ab274d3,4,,Very liberal,United States,no,"$40,000 to $59,999",about an hour,Full-time work,0,740,2,0,3,Average,45,50000,1,1,0,none,0,0,1,,8,,7,,No,Click to finish and give feedback,1,pa36a3a6c,pb7c64609,p1ab274d3,https://app.positly.com/#/f?task_id=pa36a3a6c,,,,
7568257,3,2022-08-01 23:06:47,0.5,rl4pf73,0,25,desktop,male,1,completedOnlyHighSchoolOrTheEquivalent,pa36a3a6c,2022/08/01 04:06 PM,b11d868b27664948059afbf639119c33274f9467,Good: 670 - 739,pd095718c,"White, Caucasian or European",Not at all religious,1997,p966cf14e,2,,Liberal,United States,no,"$40,000 to $59,999",about an hour,Other type of paid work,0,670,1,0,3,A little below average,45,50000,1,1,0,none,-1,0,1,,3,,2,,Yes,Click to finish and give feedback,1,pa36a3a6c,pd095718c,p966cf14e,https://app.positly.com/#/f?task_id=pa36a3a6c,,,,
7568261,3,2022-08-01 23:07:18,0.55,rl4pf73,0,40,desktop,male,0,completedOnlyHighSchoolOrTheEquivalent,pa36a3a6c,2022/08/01 04:07 PM,1e004acd23e20860e97282a749386d553137960b,I do not remember my FICO credit score,pdbda636b,"White, Caucasian or European",Not at all religious,1982,pc5aff51a,2,,Very liberal,United States,no,"$25,000 to $39,999",less than 30 minutes,Unemployed,0,300,2,0,2,Average,15,32500,1,0,0,none,0,0,1,,1,,3,,No,Click to finish and give feedback,1,pa36a3a6c,pdbda636b,pc5aff51a,https://app.positly.com/#/f?task_id=pa36a3a6c,,,,
7568262,3,2022-08-01 23:07:23,0.52,rl4pf73,0,39,desktop,male,1,completedTradeTechicalVocationalTraing,pa36a3a6c,2022/08/01 04:06 PM,0f9dcf4f3da20ad163d3738c8be3c77297199e7a,I do not have a FICO credit score,pcc451db6,"White, Caucasian or European",Moderately religious,1983,p0345d029,3,,Moderate,United States,no,"$25,000 to $39,999",up to 3 hours,Full-time work,0,-1,0,0,2,Above average,90,32500,1,1,3,none,2,0,1,,8,,7,,No,Click to finish and give feedback,1,pa36a3a6c,pcc451db6,p0345d029,https://app.positly.com/#/f?task_id=pa36a3a6c,,,,
7568263,3,2022-08-01 23:07:22,0.53,rl4pf73,0,37,desktop,female,1,completedMastersDegree,pa36a3a6c,2022/08/01 04:07 PM,f252a4c027e4c397e60e2c33ee26c364c4f4168e,Very Good: 740 - 799,pc481ed13,"White, Caucasian or European",Not at all religious,1985,p11fd6039,6,,Very liberal,United States,no,"$150,000 to $199,999",up to 3 hours,Full-time work,1,740,2,0,7,A little below average,90,175000,,1,0,anxiety,-1,1,1,,5,,7,1,No,Click to finish and give feedback,1,pa36a3a6c,pc481ed13,p11fd6039,https://app.positly.com/#/f?task_id=pa36a3a6c,,,,
7568264,3,2022-08-01 23:07:42,0.35,rl4pf73,0,31,desktop,male,1,completedMastersDegree,pa36a3a6c,2022/08/01 04:07 PM,e6086949e2283995277a3674863196af867a144c,Very Good: 740 - 799,pbc90f9b5,"White, Caucasian or European",Very religious,1991,pcb28a49c,6,,Conservative,United States,no,"$60,000 to $84,999",about an hour,Full-time work,0,740,-1,0,4,A little above average,45,72500,,1,4,none,1,0,1,,7,,7,1,No,Click to finish and give feedback,1,pa36a3a6c,pbc90f9b5,pcb28a49c,https://app.positly.com/#/f?task_id=pa36a3a6c,,,,
7568265,3,2022-08-01 23:07:43,0.2,rl4pf73,0,27,desktop,male,1,completedOnlyHighSchoolOrTheEquivalent,pa36a3a6c,2022/08/01 04:07 PM,68f4f3460b42050f91dca9c2dc86e3f174419977,I do not have a FICO credit score,pc11ae3c4,"White, Caucasian or European",Not at all religious,1995,p39071bf1,2,,Conservative,United States,no,"$40,000 to $59,999",about an hour,Own business / Self-employed,0,-1,-1,0,3,Above average,45,50000,1,1,0,anxiety,2,1,1,,8,,8,,No,Click to finish and give feedback,1,pa36a3a6c,pc11ae3c4,p39071bf1,https://app.positly.com/#/f?task_id=pa36a3a6c,,,,
7568266,3,2022-08-01 23:07:45,0.92,rl4pf73,0,41,desktop,female,1,completedOnlyHighSchoolOrTheEquivalent,pa36a3a6c,2022/08/01 04:07 PM,8da4a1c4f778abad740e86b160004ab0f55ad6f0,Fair: 580 - 669,pf36de804,"Black, African or African Descent",Extremely religious,1981,p63cf505e,2,1,Moderate,United States,no,"$60,000 to $84,999",less than 30 minutes,Own business / Self-employed,1,580,0,0,4,A little below average,15,72500,1,1,5,other,-1,1,,,1,,1,,No,Click to finish and give feedback,1,pa36a3a6c,pf36de804,p63cf505e,https://app.positly.com/#/f?task_id=pa36a3a6c,,,,
7568267,3,2022-08-01 23:07:49,0.27,rl4pf73,0,35,desktop,female,1,completedProfessionalDegree,pa36a3a6c,2022/08/01 04:07 PM,dd1d5c5e601918131869d8eddc32dc75455bfa8a,Very Good: 740 - 799,pf2ac5d3a,Pacific Islander or Native Hawaiian,Moderately religious,1987,pdaecdad2,7,,Liberal,United States,no,"$60,000 to $84,999",up to 3 hours,Full-time work,1,740,1,0,4,Average,90,72500,,1,3,depression,0,1,,,8,,8,1,No,Click to finish and give feedback,1,pa36a3a6c,pf2ac5d3a,pdaecdad2,https://app.positly.com/#/f?task_id=pa36a3a6c,,,1,
7568268,3,2022-08-01 23:07:53,0.4,rl4pf73,0,52,desktop,male,0,completedDoctorateDegree,pa36a3a6c,2022/08/01 04:07 PM,bc7b2395bf2616bbc88aa37dbfb3a2a838a16ca1,Exceptional: 800 - 850,pc89b74da,"White, Caucasian or European",Not at all religious,1970,pa04c0f60,8,,Liberal,United States,no,"$150,000 to $199,999",less than 30 minutes,Homemaker,0,800,1,0,7,A little above average,15,175000,,1,0,anxiety,1,1,1,,3,,4,1,No,Click to finish and give feedback,1,pa36a3a6c,pc89b74da,pa04c0f60,https://app.positly.com/#/f?task_id=pa36a3a6c,,,,
7568269,3,2022-08-01 23:07:53,0.45,rl4pf73,0,36,desktop,female,1,completedOnlyHighSchoolOrTheEquivalent,pa36a3a6c,2022/08/01 04:07 PM,ac4427f2b859b668c670cd35eb2e10ce77e66a9d,Very Good: 740 - 799,pc412e2dd,"White, Caucasian or European",Not at all religious,1986,p6b138af6,2,,Conservative,United States,no,"$85,000 to $114,999",about an hour,Part-time work,1,740,-1,0,5,Average,45,100000,,1,0,none,0,0,1,,3,,6,1,No,Click to finish and give feedback,1,pa36a3a6c,pc412e2dd,p6b138af6,https://app.positly.com/#/f?task_id=pa36a3a6c,,,,
7568270,3,2022-08-01 23:08:05,0.2,rl4pf73,0,35,desktop,male,1,completedOnlyHighSchoolOrTheEquivalent,pa36a3a6c,2022/08/01 04:07 PM,7f5cd107334ff34b42c6b86d4506e7d6b2ef6a55,Very Poor: 300 - 579,pc2b1b61b,"White, Caucasian or European",Not at all religious,1987,p9a61f3e3,2,,Very liberal,United States,no,"$85,000 to $114,999",less than 30 minutes,Full-time work,0,300,2,0,5,Average,15,100000,1,1,0,anxiety,0,1,1,,3,,3,,No,Click to finish and give feedback,1,pa36a3a6c,pc2b1b61b,p9a61f3e3,https://app.positly.com/#/f?task_id=pa36a3a6c,,,,
7568272,3,2022-08-01 23:08:12,0.28,rl4pf73,0,24,desktop,male,0,completedMastersDegree,pa36a3a6c,2022/08/01 04:07 PM,45e6b405c664fb2711a55d37515e7a1e8f9ea772,I do not remember my FICO credit score,paa05f176,"White, Caucasian or European",Not at all religious,1998,p33a29add,6,,Liberal,United States,no,"$25,000 to $39,999",about an hour,Studying,0,300,1,0,2,A little below average,45,32500,1,0,0,anxiety,-1,1,1,,3,,5,,No,Click to finish and give feedback,1,pa36a3a6c,paa05f176,p33a29add,https://app.positly.com/#/f?task_id=pa36a3a6c,,,,
7568273,3,2022-08-01 23:08:11,0.32,rl4pf73,0,28,desktop,male,1,completedOnlyHighSchoolOrTheEquivalent,pa36a3a6c,2022/08/01 04:06 PM,befb7f6485bfcbde57e2b05d519df83336cb6c34,I do not remember my FICO credit score,pc2b5b564,"Black, African or African Descent",Not at all religious,1994,pc5507583,2,1,Very liberal,United States,no,"$10,000 to $24,999",up to 3 hours,Part-time work,0,300,2,0,1,Average,90,17500,1,0,0,none,0,0,,,3,,3,,No,Click to finish and give feedback,1,pa36a3a6c,pc2b5b564,pc5507583,https://app.positly.com/#/f?task_id=pa36a3a6c,,,,
7568274,3,2022-08-01 23:08:12,0.28,rl4pf73,0,32,desktop,male,1,completedAssociateDegreeOnly,pa36a3a6c,2022/08/01 04:07 PM,8be49dd62b3ef8ac0236e7823b470091d1b7983c,I do not remember my FICO credit score,pf048c72c,"Asian (e.g. Chinese, Indian)",Very religious,1990,pec950180,4,,Moderate,United States,no,"$40,000 to $59,999",less than 30 minutes,Full-time work,0,300,0,0,3,Average,15,50000,,0,4,none,0,0,,1,2,,2,,Yes,Click to finish and give feedback,1,pa36a3a6c,pf048c72c,pec950180,https://app.positly.com/#/f?task_id=pa36a3a6c,,,,1
7568276,3,2022-08-01 23:08:29,0.53,rl4pf73,0,65,desktop,female,1,completedBachelorsDegree,pa36a3a6c,2022/08/01 04:08 PM,5bfd3e1ca1483c3f886f7d457967b165b56a3a14,Very Good: 740 - 799,pd4d51a3b,"White, Caucasian or European",Moderately religious,1957,p5734fe5c,5,,Very liberal,United States,yes,"$85,000 to $114,999",less than 30 minutes,Full-time work,1,740,2,1,5,Above average,15,100000,,1,3,anxiety,2,1,1,1,9,,8,,No,Click to finish and give feedback,1,pa36a3a6c,pd4d51a3b,p5734fe5c,https://app.positly.com/#/f?task_id=pa36a3a6c,,,,
7568277,3,2022-08-01 23:08:38,0.37,rl4pf73,0,56,desktop,female,1,completedTradeTechicalVocationalTraing,pa36a3a6c,2022/08/01 04:07 PM,87e8b21d56533440af9a1599f0f22fd787553758,Fair: 580 - 669,pdde4cac7,Pacific Islander or Native Hawaiian,Very religious,1966,pd5e3aab0,3,,Very liberal,United States,yes,"$10,000 to $24,999",about an hour,Full-time work,1,580,2,1,1,Above average,45,17500,,1,4,other,2,1,,,10,,10,1,No,Click to finish and give feedback,1,pa36a3a6c,pdde4cac7,pd5e3aab0,https://app.positly.com/#/f?task_id=pa36a3a6c,,,1,
7568282,3,2022-08-01 23:09:08,7.33,rl4pf73,0,30,desktop,female,0,completedOnlyHighSchoolOrTheEquivalent,pa36a3a6c,2022/08/01 04:04 PM,8b676fa3ed998c63b08c674dda962b2e6d8dcf61,Very Poor: 300 - 579,pcd6f4641,"White, Caucasian or European",Slightly religious,1992,pc0fb0658,2,,Moderate,United States,no,"$25,000 to $39,999",up to 3 hours,Homemaker,1,300,0,0,2,Average,90,32500,,1,1,anxiety,0,1,1,1,5,,5,,Yes,Click to finish and give feedback,1,pa36a3a6c,pcd6f4641,pc0fb0658,https://app.positly.com/#/f?task_id=pa36a3a6c,,,,
7568284,3,2022-08-01 23:09:25,0.38,rl4pf73,0,37,desktop,male,1,completedBachelorsDegree,pa36a3a6c,2022/08/01 04:09 PM,23950f994b0bc9a4c29f6cb8dc68d8049ca559e3,I do not have a FICO credit score,pa125d889,"White, Caucasian or European",Not at all religious,1985,p6365240b,5,,Liberal,United States,no,"$40,000 to $59,999",up to 3 hours,Part-time work,0,-1,1,0,3,Below average,90,50000,1,1,0,anxiety,-2,1,1,,4,,6,,No,Click to finish and give feedback,1,pa36a3a6c,pa125d889,p6365240b,https://app.positly.com/#/f?task_id=pa36a3a6c,,,,
7568288,3,2022-08-01 23:09:46,0.35,rl4pf73,0,47,desktop,female,1,completedAssociateDegreeOnly,pa36a3a6c,2022/08/01 04:09 PM,e1bbf24c54a93001013f5a9ace5a41eb2fe54b71,I do not remember my FICO credit score,pa136e7e1,"White, Caucasian or European",Slightly religious,1975,p5116f10f,4,,Very liberal,United States,no,"$25,000 to $39,999",more than 3 hours,Full-time work,1,300,2,0,2,A little below average,180,32500,1,0,1,none,-1,0,1,,2,,3,,No,Click to finish and give feedback,1,pa36a3a6c,pa136e7e1,p5116f10f,https://app.positly.com/#/f?task_id=pa36a3a6c,,,,
7568290,3,2022-08-01 23:10:03,0.4,rl4pf73,0,39,desktop,male,1,completedBachelorsDegree,pa36a3a6c,2022/08/01 04:09 PM,ab14cd35ab2a771d010069d9af0519f49578ee11,Very Good: 740 - 799,pd2555825,"White, Caucasian or European",Not at all religious,1983,pbae207b1,5,,Moderate,United States,no,"$40,000 to $59,999",less than 30 minutes,Full-time work,0,740,0,0,3,Average,15,50000,,1,0,none,0,0,1,,7,,5,1,No,Click to finish and give feedback,1,pa36a3a6c,pd2555825,pbae207b1,https://app.positly.com/#/f?task_id=pa36a3a6c,,,,
7568292,3,2022-08-01 23:10:14,0.25,rl4pf73,0,43,desktop,female,0,completedTradeTechicalVocationalTraing,pa36a3a6c,2022/08/01 04:09 PM,1f6003b312ac1d8c7162c8b4759bbf463ef9dc50,Fair: 580 - 669,pc30236f3,"White, Caucasian or European",Somewhat religious,1979,pa75cfc5d,3,,Moderate,United States,no,"$115,000 to $149,999",less than 30 minutes,Homemaker,1,580,0,0,6,Average,15,132500,,1,2,anxiety,0,1,1,,8,,7,1,No,Click to finish and give feedback,1,pa36a3a6c,pc30236f3,pa75cfc5d,https://app.positly.com/#/f?task_id=pa36a3a6c,,,,
7568294,3,2022-08-01 23:11:03,0.5,rl4pf73,0,56,desktop,male,1,completedBachelorsDegree,pa36a3a6c,2022/08/01 04:10 PM,d5caf0e12e0894114c06c7b7c9a216277dc74f3f,Very Good: 740 - 799,pb9014e88,"White, Caucasian or European",Very religious,1966,p50c4c4ab,5,,Liberal,United States,no,"$115,000 to $149,999",less than 30 minutes,Full-time work,0,740,1,0,6,Above average,15,132500,,1,4,depression,2,1,1,,9,,9,1,No,Click to finish and give feedback,1,pa36a3a6c,pb9014e88,p50c4c4ab,https://app.positly.com/#/f?task_id=pa36a3a6c,,,,
7568295,3,2022-08-01 23:11:18,0.48,rl4pf73,0,37,desktop,male,1,completedBachelorsDegree,pa36a3a6c,2022/08/01 04:11 PM,7cb702910fe10c6225ede92fb7ab8c15c902ae39,Exceptional: 800 - 850,pbea6fc9c,"White, Caucasian or European",Somewhat religious,1985,pe536b903,5,,Liberal,United States,no,"$115,000 to $149,999",about an hour,Full-time work,0,800,1,0,6,Above average,45,132500,,1,2,none,2,0,1,,3,,2,1,Yes,Click to finish and give feedback,1,pa36a3a6c,pbea6fc9c,pe536b903,https://app.positly.com/#/f?task_id=pa36a3a6c,,,,